BDBM21144 (3S)-3-[(2S)-2-[(2R)-2-{2-[(2R)-2-[(2S)-2-amino-3-(4-hydroxyphenyl)propanamido]propanamido]acetamido}-3-(1H-indol-3-yl)propanamido]hexanamido]-3-{[(1S)-1-carbamoyl-2-phenylethyl]carbamoyl}propanoic acid::CCK-Opioid Peptide, 14::Tyr-D-Ala-Gly-D-Trp-Nle-Asp-Phe-NH2
SMILES CCCC[C@H](NC(=O)[C@@H](Cc1c[nH]c2ccccc12)NC(=O)CNC(=O)[C@@H](C)NC(=O)[C@@H](N)Cc1ccc(O)cc1)C(=O)N[C@@H](CC(O)=O)C(=O)N[C@@H](Cc1ccccc1)C(N)=O
InChI Key InChIKey=LTNSZIYAGMZDDY-GUNATADUSA-N
Data  4 KI  3 EC50
  Tab Delimited (TSV)   2D SDfile   Computed 3D by Vconf -m prep SDfile
Find this compound or compounds like it in BindingDB:
Activity Spreadsheet -- Enzyme Inhibition Constant Data from BindingDB
Found 4 hits for monomerid = 21144
TargetMu-type opioid receptor(Rattus norvegicus (rat))
University of Arizona Tucson
LigandPNGBDBM21144((3S)-3-[(2S)-2-[(2R)-2-{2-[(2R)-2-[(2S)-2-amino-3-...)
Affinity DataKi:  590nM EC50:  350nM. Assay description: Log IC50 values for each test compound were determined from nonlinear regression analysis of data collected from two independent experiments performe...
In DepthDetails ArticlePubMed
TargetDelta-type opioid receptor(Homo sapiens (Human))
University of Arizona Tucson
LigandPNGBDBM21144((3S)-3-[(2S)-2-[(2R)-2-{2-[(2R)-2-[(2S)-2-amino-3-...)
Affinity DataKi:  860nM ΔG°:  -8.27kcal/mole EC50:  130nMpH: 7.4 T: 2°C. Assay description: Log IC50 values for each test compound were determined from nonlinear regression analysis of data collected from two independent experiments performe...
In DepthDetails ArticlePubMed
TargetGastrin/cholecystokinin type B receptor(Homo sapiens (Human))
University of Arizona Tucson
LigandPNGBDBM21144((3S)-3-[(2S)-2-[(2R)-2-{2-[(2R)-2-[(2S)-2-amino-3-...)
Affinity DataKi:  2.70E+3nM EC50:  330nM. Assay description: Log IC50 values for each test compound were determined from nonlinear regression analysis of data collected from two independent experiments performe...
In DepthDetails ArticlePubMed
TargetCholecystokinin receptor type A(Homo sapiens (Human))
University of Arizona Tucson
LigandPNGBDBM21144((3S)-3-[(2S)-2-[(2R)-2-{2-[(2R)-2-[(2S)-2-amino-3-...)
Affinity DataKi:  6.50E+3nM. Assay description: Log IC50 values for each test compound were determined from nonlinear regression analysis of data collected from two independent experiments performe...
In DepthDetails ArticlePubMed