BDBM212838 US9278960, 1-9::US9663506, Example 1-9
SMILES NC(=O)c1cc(-c2c(F)cc(Cl)cc2F)c2ccccc2n1
InChI Key InChIKey=NVJCHSUTTDBONN-UHFFFAOYSA-N
Data  2 IC50
  Tab Delimited (TSV)   2D SDfile   Computed 3D by Vconf -m prep SDfile
Find this compound or compounds like it in BindingDB:
Activity Spreadsheet -- Enzyme Inhibition Constant Data from BindingDB
Found 2 hits for monomerid = 212838
TargetMetabotropic glutamate receptor 2(Homo sapiens (Human))
Merck Sharp & Dohme
US Patent
LigandPNGBDBM212838(US9278960, 1-9 | US9663506, Example 1-9)
Affinity DataIC50:  171nM. Assay description: The utility of the compounds in accordance with the present invention as antagonists of metabotropic glutamate receptor activity, in particular mGluR...
Ligand InfoPC cidPC sid
In DepthDetails US Patent
LigandPNGBDBM212838(US9278960, 1-9 | US9663506, Example 1-9)
Affinity DataIC50:  171nM. Assay description: The utility of the compounds in accordance with the present invention as antagonists of metabotropic glutamate receptor activity, in particular mGluR...
Ligand InfoPC cidPC sid
In DepthDetails US Patent