BDBM213012 US9278960, 4-96::US9663506, Example 4-96
SMILES Cn1cc(cn1)-c1cc(nc2cc(CN3C[C@@H](OCC3(C)C)C(F)(F)F)ccc12)C(N)=O
InChI Key InChIKey=FBRYAVAHAIEOJM-LJQANCHMSA-N
Data  3 IC50
  Tab Delimited (TSV)   2D SDfile   Computed 3D by Vconf -m prep SDfile
Find this compound or compounds like it in BindingDB:
Activity Spreadsheet -- Enzyme Inhibition Constant Data from BindingDB
Found 3 hits for monomerid = 213012
LigandPNGBDBM213012(US9278960, 4-96 | US9663506, Example 4-96)
Affinity DataIC50:  8nM. Assay description: The utility of the compounds in accordance with the present invention as antagonists of metabotropic glutamate receptor activity, in particular mGluR...
Ligand InfoPC cidPC sid
In DepthDetails US Patent
TargetMetabotropic glutamate receptor 2(Homo sapiens (Human))
Merck Sharp & Dohme
US Patent
LigandPNGBDBM213012(US9278960, 4-96 | US9663506, Example 4-96)
Affinity DataIC50:  8nM. Assay description: The utility of the compounds in accordance with the present invention as antagonists of metabotropic glutamate receptor activity, in particular mGluR...
Ligand InfoPC cidPC sid
In DepthDetails US Patent
TargetMetabotropic glutamate receptor 2(Homo sapiens (Human))
Merck Sharp & Dohme
US Patent
LigandPNGBDBM213012(US9278960, 4-96 | US9663506, Example 4-96)
Affinity DataIC50:  8nM. Assay description: The utility of the compounds in accordance with the present invention as antagonists of metabotropic glutamate receptor activity, in particular mGluR...
Ligand InfoPC cidPC sid
In DepthDetails US Patent