BDBM214808 US9296734, 9
SMILES COc1cnc2c(Nc3ccc(F)c(c3)[C@]3(CF)C[C@H](OC(N)=N3)C(F)(F)F)nccc2n1
InChI Key InChIKey=PCNDBEIQPLJGIC-IFXJQAMLSA-N
Data  3 IC50
  Tab Delimited (TSV)   2D SDfile   Computed 3D by Vconf -m prep SDfile
Find this compound or compounds like it in BindingDB:
Activity Spreadsheet -- Enzyme Inhibition Constant Data from BindingDB
Found 3 hits for monomerid = 214808
TargetBeta-secretase 1(Homo sapiens (Human))
Amgen
US Patent
LigandPNGBDBM214808(US9296734, 9)
Affinity DataIC50:  372nMT: 2°C. Assay description: The cell-based assay measures inhibition or reduction of Aβ40 in conditioned medium of test compound treated cells expressing amyloid precursor ...
Ligand InfoPC cidPC sid
In DepthDetails US Patent
TargetCathepsin D(Homo sapiens (Human))
Amgen
US Patent
LigandPNGBDBM214808(US9296734, 9)
Affinity DataIC50: >4.00E+5nMpH: 3.5Assay Description:Recombinant Cat D was expressed in CHO cells. The assay buffer for CathepsinD is 0.05 M citrate pH 3.5, 10% DMSO final, 5 mM CHAPS. The Cat D enzyme ...
Ligand InfoPC cidPC sid
In DepthDetails US Patent
TargetBeta-secretase 1(Homo sapiens (Human))
Amgen
US Patent
LigandPNGBDBM214808(US9296734, 9)
Affinity DataIC50:  50nMpH: 4.2Assay Description:The assay buffer used in this screen is 0.05 M acetate, pH 4.2, 10% DMSO final, 100 uM genapol (which is a nonionic detergent, below its Critical Mic...
Ligand InfoPC cidPC sid
In DepthDetails US Patent