BDBM217336 US9303018, 9
SMILES CN(Cc1cnc2cc(Oc3ccc(cn3)-c3ccn[nH]3)ccc2c1)[C@@H]1CCN(C1)C(=O)CO
InChI Key
Data  1 IC50
  Tab Delimited (TSV)   2D SDfile   Computed 3D by Vconf -m prep SDfile
Find this compound or compounds like it in BindingDB:
Activity Spreadsheet -- Enzyme Inhibition Constant Data from BindingDB
Found 1 hit for monomerid = 217336
TargetLeukotriene A-4 hydrolase(Homo sapiens (Human))
Boehringer Ingelheim International
US Patent
LigandPNGBDBM217336(US9303018, 9)
Affinity DataIC50:  0.880nMpH: 7.5 T: 2°C. Assay description: The compounds of the invention are assessed for the ability to interact with human LTA4 hydrolase in an enzymatic assay that measures the ability of ...
Ligand InfoPC cidPC sid
In DepthDetails US Patent