BDBM22059 9-cyclopentyl-6-{[(4-methoxyphenyl)methyl]amino}-9H-purine-2-carbonitrile::Compound 3{5,13}
SMILES COc1ccc(CNc2nc(nc3n(cnc23)C2CCCC2)C#N)cc1
InChI Key InChIKey=OQBOMLCSQVWCDY-UHFFFAOYSA-N
Data  1 IC50
  Tab Delimited (TSV)   2D SDfile   Computed 3D by Vconf -m prep SDfile
Find this compound or compounds like it in BindingDB:
Activity Spreadsheet -- Enzyme Inhibition Constant Data from BindingDB
Found 1 hit for monomerid = 22059
TargetCathepsin B-like cysteine protease(Trypanosoma brucei)
University of California San Francisco
LigandPNGBDBM22059(9-cyclopentyl-6-{[(4-methoxyphenyl)methyl]amino}-9...)
Affinity DataIC50:  7.00E+3nMpH: 5.5 T: 2°C. Assay description: Enzyme activity was assayed in a 96-well plate format. TbcatB was incubated with inhibitor compound at room temperature for 20 min before the additio...
In DepthDetails ArticlePubMed