BDBM221808 US9314468, Table 7, Compound 95::US9314468, Table 9, Compound 9
SMILES NCCCCN(Cc1nccc2c3ccccc3n(CCCN)c12)[C@H]1CCCc2cccnc12
InChI Key InChIKey=ANWJCECNNDZVCW-SANMLTNESA-N
Data  2 IC50
  Tab Delimited (TSV)   2D SDfile   Computed 3D by Vconf -m prep SDfile
Find this compound or compounds like it in BindingDB:
Activity Spreadsheet -- Enzyme Inhibition Constant Data from BindingDB
Found 2 hits for monomerid = 221808
TargetC-X-C chemokine receptor type 4(Homo sapiens (Human))
Altiris Therapeutics
US Patent
LigandPNGBDBM221808(US9314468, Table 7, Compound 95 | US9314468, Table...)
Affinity DataIC50:  7nMT: 2°C. Assay description: Functional modulation of CXCR4 was determined by calcium mobilization assay using leukemic lymphoid CEM cells, which naturally express high levels of...
Ligand InfoPC cidPC sid
In DepthDetails US Patent
TargetC-X-C chemokine receptor type 4(Homo sapiens (Human))
Altiris Therapeutics
US Patent
LigandPNGBDBM221808(US9314468, Table 7, Compound 95 | US9314468, Table...)
Affinity DataIC50:  21nMT: 2°C. Assay description: Functional modulation of CXCR4 was determined by calcium mobilization assay using leukemic lymphoid CEM cells, which naturally express high levels of...
Ligand InfoPC cidPC sid
In DepthDetails US Patent