BDBM223150 Ethyl 2-(4-(4-(2-(ethyl(m-tolyl)amino)-2-oxoethyl)-4H-thieno[3,2-b]pyrrole-5carboxamido)phenyl)acetate (12)
SMILES CCOC(=O)Cc1ccc(NC(=O)c2cc3sccc3n2CC(=O)N(CC)c2cccc(C)c2)cc1
InChI Key InChIKey=CNYLVCBBXDGCCB-UHFFFAOYSA-N
Data  1 IC50
  Tab Delimited (TSV)   2D SDfile   Computed 3D by Vconf -m prep SDfile
Find this compound or compounds like it in BindingDB:
Activity Spreadsheet -- Enzyme Inhibition Constant Data from BindingDB
Found 1 hit for monomerid = 223150
TargetOplophorus-luciferin 2-monooxygenase catalytic subunit(Oplophorus gracilirostris (Luminous shrimp))
Promega Biosciences
LigandPNGBDBM223150(Ethyl 2-(4-(4-(2-(ethyl(m-tolyl)amino)-2-oxoethyl)...)
Affinity DataIC50:  4.70E+3nM. Assay description: NanoLuc enzyme was diluted to 0.4 ng/mL in CO2 independent media + 10% FBS to make the detection reagent. A 3× dilution series of each inhibitor was ...
Ligand InfoPC cidPC sid
In DepthDetails ArticlePubMed