BDBM22574 2-{1-[(4-chlorophenyl)carbonyl]-5-methoxy-2-methyl-1H-indol-3-yl}-N-[(2R)-1-hydroxy-4-(methylsulfanyl)butan-2-yl]acetamide::CHEMBL432260::alpha-substituted indomethacin ethanolamide, 14
SMILES COc1ccc2n(C(=O)c3ccc(Cl)cc3)c(C)c(CC(=O)N[C@@H](CO)CCSC)c2c1
InChI Key InChIKey=PMLQJXADXWPWHU-GOSISDBHSA-N
Data  4 IC50
  Tab Delimited (TSV)   2D SDfile   Computed 3D by Vconf -m prep SDfile
Find this compound or compounds like it in BindingDB:
Activity Spreadsheet -- Enzyme Inhibition Constant Data from BindingDB
Found 4 hits for monomerid = 22574
TargetProstaglandin G/H synthase 1(Ovis aries (Sheep))
Michigan State University
LigandPNGBDBM22574(2-{1-[(4-chlorophenyl)carbonyl]-5-methoxy-2-methyl...)
Affinity DataIC50:  5.10E+4nMpH: 8.0 T: 2°C. Assay description: For the time-dependent inhibition studies, COX enzyme was incubated with test co mpounds for 20 min and then analyzed for remaining COX activity by t...
In DepthDetails ArticlePubMed
TargetProstaglandin G/H synthase 2(Homo sapiens (Human))
Vanderbilt University School Of Medicine
Curated by ChEMBL
LigandPNGBDBM22574(2-{1-[(4-chlorophenyl)carbonyl]-5-methoxy-2-methyl...)
Affinity DataIC50:  250nM. Assay description: Inhibitory concentration against human prostaglandin G/H synthase 2
In DepthDetails ArticlePubMed
TargetProstaglandin G/H synthase 1(Ovis aries (Sheep))
Michigan State University
LigandPNGBDBM22574(2-{1-[(4-chlorophenyl)carbonyl]-5-methoxy-2-methyl...)
Affinity DataIC50:  5.10E+4nM. Assay description: Inhibitory concentration against prostaglandin G/H synthase 1
In DepthDetails ArticlePubMed
TargetProstaglandin G/H synthase 2(Homo sapiens (Human))
Vanderbilt University School Of Medicine
Curated by ChEMBL
LigandPNGBDBM22574(2-{1-[(4-chlorophenyl)carbonyl]-5-methoxy-2-methyl...)
Affinity DataIC50:  250nMpH: 8.0 T: 2°C. Assay description: For the time-dependent inhibition studies, COX enzyme was incubated with test co mpounds for 20 min and then analyzed for remaining COX activity by t...
In DepthDetails ArticlePubMed