BDBM226160 Ethyl 2-(6-chloro-3-(4-methoxyphenyl)-4-oxo-3,4-dihydroquinazolin-2-yl-thio)acetate (12)
SMILES CCOC(=O)CSc1nc2ccc(Cl)cc2c(=O)n1-c1ccc(OC)cc1
InChI Key InChIKey=IGLJWNMDPHMKQH-UHFFFAOYSA-N
Data  1 IC50
  Tab Delimited (TSV)   2D SDfile   Computed 3D by Vconf -m prep SDfile
Find this compound or compounds like it in BindingDB:
Activity Spreadsheet -- Enzyme Inhibition Constant Data from BindingDB
Found 1 hit for monomerid = 226160
TargetDihydrofolate reductase(Bos taurus (Cattle))
Future University
LigandPNGBDBM226160(Ethyl 2-(6-chloro-3-(4-methoxyphenyl)-4-oxo-3,4-di...)
Affinity DataIC50:  1.70E+3nMpH: 7.4 T: 2°C. Assay description: The assay mixture contained 50 μM Tris-HCl buffer (pH 7.4), 50 μM NADPH, 10 μl DMSO or the same volume of DMSO solution containing the...
Ligand InfoPC cidPC sid
In DepthDetails