BDBM226445 US9328096, 138
SMILES Nc1ccc(CNC(=O)c2cc(NC(=O)c3cc(c(F)cc3Cl)-c3ccccn3)n(n2)-c2ccccc2)cn1
InChI Key InChIKey=DVNATNJWHUNPIE-UHFFFAOYSA-N
Data  1 IC50
  Tab Delimited (TSV)   2D SDfile   Computed 3D by Vconf -m prep SDfile
Find this compound or compounds like it in BindingDB:
Activity Spreadsheet -- Enzyme Inhibition Constant Data from BindingDB
Found 1 hit for monomerid = 226445
TargetHigh affinity nerve growth factor receptor [441-796](Homo sapiens (Human))
Pfizer
US Patent
LigandPNGBDBM226445(US9328096, 138)
Affinity DataIC50:  3.41nMT: 2°C. Assay description: TRKA co-expressed with p75: The assays are based upon DiscoveRx's proprietary Enzyme Fragment Complementation (EFC) technology. In the case of the TR...
Ligand InfoPC cidPC sid
In DepthDetails US Patent