BDBM228832 N-(Cyclopentylmethyl)pyrrolidine-1-sulfonamide (6)
SMILES O=S(=O)(NCC1CCCC1)N1CCCC1
InChI Key InChIKey=QDQADHOBSHAHQM-UHFFFAOYSA-N
Data  1 Kd
  Tab Delimited (TSV)   2D SDfile   Computed 3D by Vconf -m prep SDfile
Find this compound or compounds like it in BindingDB:
Activity Spreadsheet -- Enzyme Inhibition Constant Data from BindingDB
Found 1 hit for monomerid = 228832
TargetHTH-type transcriptional regulator EthR(Mycobacterium tuberculosis)
University of Cambridge
LigandPNGBDBM228832(N-(Cyclopentylmethyl)pyrrolidine-1-sulfonamide (6))
Affinity DataKd:  2.00E+4nM. Assay description: An aqueous solution of the fragment to be tested (1 mM) was prepared containing NaCl (300 mM), Tris.HCl (20 mM, pH = 8.0), d6-DMSO (10% v/v) and glyc...
In DepthDetails ArticlePubMed