BDBM23026 4-(benzyloxy)phenyl N-[2-(5-hydroxy-1H-indol-3-yl)ethyl]carbamate::N-arachidonoylserotonin carbamate analogue, 3q
SMILES Oc1ccc2[nH]cc(CCNC(=O)Oc3ccc(OCc4ccccc4)cc3)c2c1
InChI Key InChIKey=CDPFIJGBIPXSIL-UHFFFAOYSA-N
Data  2 IC50
  Tab Delimited (TSV)   2D SDfile   Computed 3D by Vconf -m prep SDfile
Find this compound or compounds like it in BindingDB:
Activity Spreadsheet -- Enzyme Inhibition Constant Data from BindingDB
Found 2 hits for monomerid = 23026
TargetTransient receptor potential cation channel subfamily V member 1(Homo sapiens (Human))
Sapienza University Of Rome
LigandPNGBDBM23026(4-(benzyloxy)phenyl N-[2-(5-hydroxy-1H-indol-3-yl)...)
Affinity DataIC50: >1.00E+4nMT: 2°C. Assay description: The antagonistic effects of test compounds were evaluated using HEK293 cells stably overexpressing human TRPV1. Experiments were carried out by measu...
In DepthDetails ArticlePubMed
TargetFatty-acid amide hydrolase 1 [30-579](Rattus norvegicus (rat))
Sapienza University Of Rome
LigandPNGBDBM23026(4-(benzyloxy)phenyl N-[2-(5-hydroxy-1H-indol-3-yl)...)
Affinity DataIC50:  1.17E+3nM. Assay description: The effect of the test compounds on the enzymatic hydrolysis of [14C]anandamide was evaluated by using membranes prepared from rat brain. [14C]Ethano...
In DepthDetails ArticlePubMed