BDBM233098 Ethyl {4-[7-(2-diethylaminoethoxy)-6-methoxy-quinazolin-4-ylamino]phenyl}carbamate hydrochloride (7c)
SMILES CCOC(=O)Nc1ccc(Nc2ncnc3cc(OCCN(CC)CC)c(OC)cc23)cc1
InChI Key InChIKey=SHLYCRFAVDOEGH-UHFFFAOYSA-N
Data  2 IC50
  Tab Delimited (TSV)   2D SDfile   Computed 3D by Vconf -m prep SDfile
Find this compound or compounds like it in BindingDB:
Activity Spreadsheet -- Enzyme Inhibition Constant Data from BindingDB
Found 2 hits for monomerid = 233098
TargetVascular endothelial growth factor receptor 2(Homo sapiens (Human))
Universit?? Lille Nord De France
LigandPNGBDBM233098(Ethyl {4-[7-(2-diethylaminoethoxy)-6-methoxy-quina...)
Affinity DataIC50:  3.42E+4nMpH: 7.5Assay Description:Kinase assays were performed in 96-well plates (Multiscreen Durapore, Millipore) using [γ-32P]ATP (Amersham Biosciences) and the synthetic polym...
Ligand InfoPC cidPC sid
In DepthDetails ArticlePubMed
TargetEpidermal growth factor receptor(Homo sapiens (Human))
Universit?? Lille Nord De France
LigandPNGBDBM233098(Ethyl {4-[7-(2-diethylaminoethoxy)-6-methoxy-quina...)
Affinity DataIC50:  9.40E+3nMpH: 7.5Assay Description:Kinase assays were performed in 96-well plates (Multiscreen Durapore, Millipore) using [γ-32P]ATP (Amersham Biosciences) and the synthetic polym...
Ligand InfoPC cidPC sid
In DepthDetails ArticlePubMed