BDBM233180 Sodium [5-hydroxy-5-(2-pentyloxy-quinolin-3-yl)-pent-2-ynyloxy]-acetate (18a)
SMILES CCCCCOc1nc2ccccc2cc1C(O)CC#CCOCC([O-])=O
InChI Key InChIKey=NFSOWAFWHVJPER-UHFFFAOYSA-M
Data  1 KI
  Tab Delimited (TSV)   2D SDfile   Computed 3D by Vconf -m prep SDfile
Find this compound or compounds like it in BindingDB:
Activity Spreadsheet -- Enzyme Inhibition Constant Data from BindingDB
Found 1 hit for monomerid = 233180
TargetPeroxisome proliferator-activated receptor gamma(Homo sapiens (Human))
Universit?? De Rennes 1
LigandPNGBDBM233180(Sodium [5-hydroxy-5-(2-pentyloxy-quinolin-3-yl)-pe...)
Affinity DataKi:  1.93E+3nM ΔG°:  -7.24kcal/molepH: 8.2 T: 2°C. Assay description: Binding assays were performed in 96-well plate format, using a classical filtration assay with a human full length PPARγ construct (GST-PPAR LBD...
Ligand InfoPC cidPC sid
In DepthDetails ArticlePubMed