BDBM233881 US9353090, 9
SMILES Cc1c(COc2ccccc2-c2cccc(n2)N2CC[C@]3(C[C@H]3C2)C(O)=O)ccc2CN(C[C@H]3COCCO3)CCc12
InChI Key InChIKey=TYIBBNADPPESPV-IYKVEEHISA-N
Data  1 EC50
  Tab Delimited (TSV)   2D SDfile   Computed 3D by Vconf -m prep SDfile
Find this compound or compounds like it in BindingDB:
Activity Spreadsheet -- Enzyme Inhibition Constant Data from BindingDB
Found 1 hit for monomerid = 233881
TargetGuanylate cyclase soluble subunit alpha-1/beta-1(Homo sapiens (Human))
Boehringer Ingelheim International
US Patent
LigandPNGBDBM233881(US9353090, 9)
Affinity DataEC50:  1nMT: 2°C. Assay description: The sGC cellular activator assay is performed in the presence and absence of 50% human serum (HS) using Chinese hamster ovary cells that have been st...
Ligand InfoPC cidPC sid
In DepthDetails US Patent