BDBM234419 (S)-Ethyl 2-(2-(2-aminopropanamido)thiazol-4-yl)acetate (4b)
SMILES CCOC(=O)Cc1csc(NC(=O)[C@H](C)N)n1
InChI Key InChIKey=IVKACUZVCRBKSD-LURJTMIESA-N
Data  1 IC50
  Tab Delimited (TSV)   2D SDfile   Computed 3D by Vconf -m prep SDfile
Find this compound or compounds like it in BindingDB:
Activity Spreadsheet -- Enzyme Inhibition Constant Data from BindingDB
Found 1 hit for monomerid = 234419
TargetNeuraminidase(Influenza A virus H3N2)
Shandong University
LigandPNGBDBM234419((S)-Ethyl 2-(2-(2-aminopropanamido)thiazol-4-yl)ac...)
Affinity DataIC50:  2.28E+4nM. Assay description: NA inhibitory activity was determined by the commercial NA inhibitory screening kit (Beyotime Institute of Biotechnology, Jiangsu, China). The reacti...
In DepthDetails ArticlePubMed