BDBM234426 (S)-Ethyl 2-(2-(2-(tert-butoxycarbonylamino)-3-methylbutanamido)thiazol-4-yl) acetate (6a)
SMILES CCOC(=O)Cc1csc(NC(=O)[C@@H](NC(=O)OC(C)(C)C)C(C)C)n1
InChI Key InChIKey=CLAFXTQYIQKZNM-ZDUSSCGKSA-N
Data  1 IC50
  Tab Delimited (TSV)   2D SDfile   Computed 3D by Vconf -m prep SDfile
Find this compound or compounds like it in BindingDB:
Activity Spreadsheet -- Enzyme Inhibition Constant Data from BindingDB
Found 1 hit for monomerid = 234426
TargetNeuraminidase(Influenza A virus H3N2)
Shandong University
LigandPNGBDBM234426((S)-Ethyl 2-(2-(2-(tert-butoxycarbonylamino)-3-met...)
Affinity DataIC50:  1.47E+5nM. Assay description: NA inhibitory activity was determined by the commercial NA inhibitory screening kit (Beyotime Institute of Biotechnology, Jiangsu, China). The reacti...
Ligand InfoPC cidPC sid
In DepthDetails ArticlePubMed