BDBM234438 (S)-Ethyl 2-(2-(2-(tert-butoxycarbonylamino)-3-phenylpropanamido)thiazol-4-yl) acetate (9a)
SMILES CCOC(=O)Cc1csc(NC(=O)[C@H](Cc2ccccc2)NC(=O)OC(C)(C)C)n1
InChI Key InChIKey=BOVTVNPNAGCEPF-INIZCTEOSA-N
Data  1 IC50
  Tab Delimited (TSV)   2D SDfile   Computed 3D by Vconf -m prep SDfile
Find this compound or compounds like it in BindingDB:
Activity Spreadsheet -- Enzyme Inhibition Constant Data from BindingDB
Found 1 hit for monomerid = 234438
TargetNeuraminidase(Influenza A virus H3N2)
Shandong University
LigandPNGBDBM234438((S)-Ethyl 2-(2-(2-(tert-butoxycarbonylamino)-3-phe...)
Affinity DataIC50:  9.59E+4nM. Assay description: NA inhibitory activity was determined by the commercial NA inhibitory screening kit (Beyotime Institute of Biotechnology, Jiangsu, China). The reacti...
Ligand InfoPC cidPC sid
In DepthDetails ArticlePubMed