BDBM234439 (S)-Ethyl 2-(2-(2-amino-3-phenylpropanamido)thiazol-4-yl)acetate (9b)
SMILES CCOC(=O)Cc1csc(NC(=O)[C@@H](N)Cc2ccccc2)n1
InChI Key InChIKey=AMDYQXCZUGXCGI-ZDUSSCGKSA-N
Data  1 IC50
  Tab Delimited (TSV)   2D SDfile   Computed 3D by Vconf -m prep SDfile
Find this compound or compounds like it in BindingDB:
Activity Spreadsheet -- Enzyme Inhibition Constant Data from BindingDB
Found 1 hit for monomerid = 234439
TargetNeuraminidase(Influenza A virus H3N2)
Shandong University
LigandPNGBDBM234439((S)-Ethyl 2-(2-(2-amino-3-phenylpropanamido)thiazo...)
Affinity DataIC50:  2.21E+5nM. Assay description: NA inhibitory activity was determined by the commercial NA inhibitory screening kit (Beyotime Institute of Biotechnology, Jiangsu, China). The reacti...
In DepthDetails ArticlePubMed