BDBM235175 US9359348, 9
SMILES Cc1nc(C)n(n1)-c1cc(nc(C)n1)[C@@H]1C[C@H]1c1nc2ccccn2c1C
InChI Key InChIKey=WGHDYOHZXVHSJS-HZPDHXFCSA-N
Data  1 KI
  Tab Delimited (TSV)   2D SDfile   Computed 3D by Vconf -m prep SDfile
Find this compound or compounds like it in BindingDB:
Activity Spreadsheet -- Enzyme Inhibition Constant Data from BindingDB
Found 1 hit for monomerid = 235175
LigandPNGBDBM235175(US9359348, 9)
Affinity DataKi:  2.10nM ΔG°:  -11.8kcal/moleT: 2°C. Assay description: The fluorescence polarization assay for cyclic nucleotide phosphodiesterases was performed using an IMAP FP kit supplied by Molecular Devices, Sunnyv...
Ligand InfoPC cidPC sid
In DepthDetails US Patent