BDBM237083 US9388198, 9
SMILES Cc1ncc(cn1)C(CNC(=O)C1CCOc2ncsc12)N1CCOCC1
InChI Key InChIKey=LZNHMGVDSMIJFY-UHFFFAOYSA-N
Data  1 IC50
  Tab Delimited (TSV)   2D SDfile   Computed 3D by Vconf -m prep SDfile
Find this compound or compounds like it in BindingDB:
Activity Spreadsheet -- Enzyme Inhibition Constant Data from BindingDB
Found 1 hit for monomerid = 237083
TargetP2X purinoceptor 7(Homo sapiens (Human))
Actelion Pharmaceuticals
US Patent
LigandPNGBDBM237083(US9388198, 9)
Affinity DataIC50:  1.43E+3nMT: 2°C. Assay description: Cells were grown to confluency in adherent culture at 37° C. in a humidified 5% CO2 incubator (split 1/5 every 3-4 days with DMEM, 10% FCS, 1% Pe...
Ligand InfoPC cidPC sid
In DepthDetails US Patent