BDBM237589 US9394263, 9
SMILES CN[C@@H](C)C(=O)N[C@H]1C(=O)N(Cc2c(OC)ccc3cc(Br)ccc23)c2ccc(F)c(F)c2OC11CCOCC1
InChI Key InChIKey=QTAWNOXGLQMROR-QMTYFTJSSA-N
Data  1 IC50
  Tab Delimited (TSV)   2D SDfile   Computed 3D by Vconf -m prep SDfile
Find this compound or compounds like it in BindingDB:
Activity Spreadsheet -- Enzyme Inhibition Constant Data from BindingDB
Found 1 hit for monomerid = 237589
TargetE3 ubiquitin-protein ligase XIAP [241-356](Homo sapiens (Human))
F. Hoffmann-La Roche
US Patent
LigandPNGBDBM237589(US9394263, 9)
Affinity DataIC50: >5.48E+4nMpH: 7.5 T: 2°C. Assay description: Ten nanomolar of 6x Histidine-tagged BIR2 domain, corresponding to amino acids 124-240 of XIAP, or BIR3 domain, corresponding to amino acids 241-356 ...
Ligand InfoPC cidPC sid
In DepthDetails US Patent