BDBM241319 US11046688, Example 163::US9409907, 163
SMILES COc1cc(ccc1Nc1ncc2ccnc(NCC(C)(C)OC)c2n1)-c1nnnn1C
InChI Key InChIKey=PUCSURXLSLKZSZ-UHFFFAOYSA-N
Data  1 IC50
  Tab Delimited (TSV)   2D SDfile   Computed 3D by Vconf -m prep SDfile
Find this compound or compounds like it in BindingDB:
Activity Spreadsheet -- Enzyme Inhibition Constant Data from BindingDB
Found 1 hit for monomerid = 241319
TargetDual specificity protein kinase TTK(Homo sapiens (Human))
Cancer Research Technology
US Patent
LigandPNGBDBM241319(US11046688, Example 163 | US9409907, 163)
Affinity DataIC50:  2nMpH: 7.0 T: 2°C. Assay description: The enzyme reaction (total volume 10 μl) was carried out in black 384-well low volume plates containing full length MPS1 (12.5 nM or 3 nM), fluo...
Ligand InfoPC cidPC sid
In DepthDetails US Patent