BDBM241377 US9409908, 9::US9951071, Example 9
SMILES COC(=O)Nc1ccc-2c(NC(=O)[C@H](C)CCC[C@H](N3CCC(=CC3=O)c3c(ccc4c(N)noc34)C#N)c3cc-2cc(OC)n3)c1
InChI Key InChIKey=ZWUUYRIAOVUGDT-CLYVBNDRSA-N
Data  4 KI
  Tab Delimited (TSV)   2D SDfile   Computed 3D by Vconf -m prep SDfile
Find this compound or compounds like it in BindingDB:
Activity Spreadsheet -- Enzyme Inhibition Constant Data from BindingDB
Found 4 hits for monomerid = 241377
TargetCoagulation factor XI(Homo sapiens (Human))
Bristol-Myers Squibb
US Patent
LigandPNGBDBM241377(US9409908, 9 | US9951071, Example 9)
Affinity DataKi:  33.2nM. Assay description: Factor XIa determinations were made in 50 mM HEPES buffer at pH 7.4 containing 145 mM NaCl, 5 mM KCl, and 0.1% PEG 8000 (polyethylene glycol; JT Bake...
Ligand InfoPC cidPC sid
In DepthDetails US Patent
TargetCoagulation factor IX(Homo sapiens (Human))
Bristol-Myers Squibb
US Patent
LigandPNGBDBM241377(US9409908, 9 | US9951071, Example 9)
Affinity DataKi:  33.2nMpH: 7.4Assay Description:Factor XIa determinations were made in 50 mM HEPES buffer at pH 7.4 containing 145 mM NaCl, 5 mM KCl, and 0.1% PEG 8000 (polyethylene glycol; JT Bake...
Ligand InfoPC cidPC sid
In DepthDetails US Patent
TargetPlasma kallikrein(Homo sapiens (Human))
Bristol-Myers Squibb
US Patent
LigandPNGBDBM241377(US9409908, 9 | US9951071, Example 9)
Affinity DataKi:  46nM. Assay description: Plasma kallikrein determinations were made in 0.1 M sodium phosphate buffer at a pH of 7.5 containing 0.1-0.2 M sodium chloride and 0.5% PEG 8000. De...
Ligand InfoPC cidPC sid
In DepthDetails US Patent
TargetPlasma kallikrein(Homo sapiens (Human))
Bristol-Myers Squibb
US Patent
LigandPNGBDBM241377(US9409908, 9 | US9951071, Example 9)
Affinity DataKi:  46nM ΔG°:  -10.0kcal/moleT: 2°C. Assay description: Plasma kallikrein determinations were made in 0.1 M sodium phosphate buffer at a pH of 7.5 containing 0.1-0.2 M sodium chloride and 0.5% PEG 8000. De...
Ligand InfoPC cidPC sid
In DepthDetails US Patent