BDBM243084 17-Chloro-16-formylandrost-5,16-diene-3β-yl-benzoate (7)
SMILES C[C@]12CCC3C(CC=C4C[C@H](CC[C@]34C)OC(=O)c3ccccc3)C1CC(C=O)=C2Cl
InChI Key InChIKey=MMCIKVHRSBQSHQ-PVZVGWETSA-N
Data  1 IC50
  Tab Delimited (TSV)   2D SDfile   Computed 3D by Vconf -m prep SDfile
Find this compound or compounds like it in BindingDB:
Activity Spreadsheet -- Enzyme Inhibition Constant Data from BindingDB
Found 1 hit for monomerid = 243084
Target3-oxo-5-alpha-steroid 4-dehydrogenase 1(Homo sapiens (Human))
National University Of Mexico City
LigandPNGBDBM243084(17-Chloro-16-formylandrost-5,16-diene-3β-yl-b...)
Affinity DataIC50:  650nMpH: 7.5Assay Description:The activity of the 5α-R type 1 isozyme was determined by following the conversion of T to DHT at pH 7.5. 2 nM of [1,2,6,7 3H] T, and different ...
Ligand InfoPC cidPC sid
In DepthDetails ArticlePubMed