BDBM243230 US9546173, cmpd 27::n-benzyl-n,5,5-trimethyl-2-((tetrahydro-2h-pyran-4-yl)amino)-5h-pyrrolo[3,4-d]pyrimidine-6(7h)-carboxamide
SMILES CN(Cc1ccccc1)C(=O)N1Cc2nc(NC3CCOCC3)ncc2C1(C)C
InChI Key InChIKey=UWWLVDPFJLQMOT-UHFFFAOYSA-N
Data  1 IC50
  Tab Delimited (TSV)   2D SDfile   Computed 3D by Vconf -m prep SDfile
Find this compound or compounds like it in BindingDB:
Activity Spreadsheet -- Enzyme Inhibition Constant Data from BindingDB
Found 1 hit for monomerid = 243230
TargetMitogen-activated protein kinase 1(Homo sapiens (Human))
Novartis
US Patent
LigandPNGBDBM243230(US9546173, cmpd 27 | n-benzyl-n,5,5-trimethyl-2-((...)
Affinity DataIC50:  202nMpH: 7.5Assay Description:Compound potency against activated ERK2 was determined using a kinase assay that measures ERK2-catalyzed phosphorylation of biotinylated ERKtide pept...
Ligand InfoPC cidPC sid
In DepthDetails US Patent