BDBM245428 US9428469, 9
SMILES Clc1cc(Cl)cc(Nc2n[nH]c(NCc3ccccc3)n2)c1
InChI Key InChIKey=PXGMXFAAALPZFN-UHFFFAOYSA-N
Data  1 EC50
  Tab Delimited (TSV)   2D SDfile   Computed 3D by Vconf -m prep SDfile
Find this compound or compounds like it in BindingDB:
Activity Spreadsheet -- Enzyme Inhibition Constant Data from BindingDB
Found 1 hit for monomerid = 245428
TargetGenome polyprotein [192-746](Hepatitis C virus genotype 1b (isolate Con1) (HCV))
F. Hoffmann-La Roche
US Patent
LigandPNGBDBM245428(US9428469, 9)
Affinity DataEC50:  1.72E+3nMT: 2°C. Assay description: Huh7-high CD81 cells were plated at a cell density of 8000 cells per well in 96 well plates (Perkin Elmer, cat #6005660). Cells were plated in 100 &m...
Ligand InfoPC cidPC sid
In DepthDetails US Patent