BDBM24578 (2S,5E)-1-[(2S,3S)-3-hexyl-4-oxooxetan-2-yl]tridec-5-en-2-yl (2S)-2-formamido-3-phenylpropanoate::Orlistat derivative, 21b
SMILES CCCCCCC\C=C\CC[C@@H](C[C@@H]1OC(=O)[C@H]1CCCCCC)OC(=O)[C@H](Cc1ccccc1)NC=O
InChI Key InChIKey=CHBMTUAOXUPFDI-KQFBEPMRSA-N
Data  1 IC50
  Tab Delimited (TSV)   2D SDfile   Computed 3D by Vconf -m prep SDfile
Find this compound or compounds like it in BindingDB:
Activity Spreadsheet -- Enzyme Inhibition Constant Data from BindingDB
Found 1 hit for monomerid = 24578
TargetFatty acid synthase [2202-2509](Homo sapiens (Human))
The Burnham Institute For Medical Research
LigandPNGBDBM24578((2S,5E)-1-[(2S,3S)-3-hexyl-4-oxooxetan-2-yl]tridec...)
Affinity DataIC50:  400nMpH: 7.4 T: 2°C. Assay description: The reaction mixture consisted of FAS thioesterase domain (FASTE) in buffer, which was preincubated with test compounds for 30 min. The reaction was ...
In DepthDetails ArticlePubMed