BDBM24596 (2S)-1-[(2R,3R)-3-methyl-4-oxooxetan-2-yl]tridecan-2-yl (2S)-2-formamido-4-methylpentanoate::Orlistat derivative, 16b
SMILES CCCCCCCCCCC[C@@H](C[C@H]1OC(=O)[C@@H]1C)OC(=O)[C@H](CC(C)C)NC=O
InChI Key InChIKey=RMXQCPQLDMFJSJ-CLAROIROSA-N
Data  1 IC50
  Tab Delimited (TSV)   2D SDfile   Computed 3D by Vconf -m prep SDfile
Find this compound or compounds like it in BindingDB:
Activity Spreadsheet -- Enzyme Inhibition Constant Data from BindingDB
Found 1 hit for monomerid = 24596
TargetFatty acid synthase [2202-2509](Homo sapiens (Human))
The Burnham Institute For Medical Research
LigandPNGBDBM24596((2S)-1-[(2R,3R)-3-methyl-4-oxooxetan-2-yl]tridecan...)
Affinity DataIC50:  4.51E+4nMpH: 7.4 T: 2°C. Assay description: The reaction mixture consisted of FAS thioesterase domain (FASTE) in buffer, which was preincubated with test compounds for 30 min. The reaction was ...
In DepthDetails ArticlePubMed