BDBM2471 Pyrrolobenzothiadiazepine (PBTD) 10l::ethyl 2-(2,2,8-trioxo-2-thia-3,9-diazatricyclo[8.4.0.0^{3,7}]tetradeca-1(10),4,6,11,13-pentaen-9-yl)acetate
SMILES CCOC(=O)CN1c2ccccc2S(=O)(=O)n2cccc2C1=O
InChI Key InChIKey=MRRSGQVQUITQSW-UHFFFAOYSA-N
Data  1 IC50
  Tab Delimited (TSV)   2D SDfile   Computed 3D by Vconf -m prep SDfile
Find this compound or compounds like it in BindingDB:
Activity Spreadsheet -- Enzyme Inhibition Constant Data from BindingDB
Found 1 hit for monomerid = 2471
TargetGag-Pol polyprotein [588-1027]/[588-1147](Human immunodeficiency virus type 1)
Sapienza University Of Rome
LigandPNGBDBM2471(Pyrrolobenzothiadiazepine (PBTD) 10l | ethyl 2-(2,...)
Affinity DataIC50:  3.10E+4nMpH: 7.8 T: 2°C. Assay description: The IC50 of reverse transcriptase is the concentration that inhibits 50% of recombinant HIV-1 RT RNA-directed DNA polymerase activity in vitro.
In DepthDetails ArticlePubMed