BDBM247486 US10112931, Example 9::US9434719, 9::US9688672, Example 9
SMILES CC(Nc1nccc(n1)N1[C@H](COC1=O)[C@@H](C)OC(C)(C)C)c1nc(no1)-c1cccc(c1)C(C)(C)C
InChI Key InChIKey=PSGDZLCFDHDDNW-HMEKMZBJSA-N
Data  5 IC50
  Tab Delimited (TSV)   2D SDfile   Computed 3D by Vconf -m prep SDfile
Find this compound or compounds like it in BindingDB:
Activity Spreadsheet -- Enzyme Inhibition Constant Data from BindingDB
Found 5 hits for monomerid = 247486
TargetIsocitrate dehydrogenase [NADP] cytoplasmic(Homo sapiens (Human))
Novartis
US Patent
LigandPNGBDBM247486(US10112931, Example 9 | US9434719, 9 | US9688672, ...)
Affinity DataIC50:  2.20E+3nMpH: 7.5 T: 2°C. Assay description: The IDH1 (R132H) mutant catalyzes the reduced form of NADP+ (NADPH) and α-ketoglutarate (α-KG) to form nicotinamide adenine dinucleotide ph...
Ligand InfoPC cidPC sid
In DepthDetails US Patent
TargetIsocitrate dehydrogenase [NADP] cytoplasmic(Homo sapiens (Human))
Novartis
US Patent
LigandPNGBDBM247486(US10112931, Example 9 | US9434719, 9 | US9688672, ...)
Affinity DataIC50:  3.02E+3nMpH: 7.4 T: 2°C. Assay description: The biochemical reactions were performed at room temperature in 384-well Greiner flat-bottom plates (Costar, Cat. No. 781201) using a final reaction ...
Ligand InfoPC cidPC sid
In DepthDetails US Patent
TargetIsocitrate dehydrogenase [NADP] cytoplasmic [R132H](Homo sapiens (Human))
Novartis
US Patent
LigandPNGBDBM247486(US10112931, Example 9 | US9434719, 9 | US9688672, ...)
Affinity DataIC50:  3.02E+3nMpH: 7.4 T: 2°C. Assay description: Mutant IDH1 R132H catalytic activity was monitored using the quantitative liquid chromatography/mass spectrometry (LC-MS) detection of 2-HG, a produc...
Ligand InfoPC cidPC sid
In DepthDetails US Patent
TargetIsocitrate dehydrogenase [NADP] cytoplasmic [R132H](Homo sapiens (Human))
Novartis
US Patent
LigandPNGBDBM247486(US10112931, Example 9 | US9434719, 9 | US9688672, ...)
Affinity DataIC50:  2.20E+3nMpH: 7.5 T: 2°C. Assay description: The IDH1 (R132H) mutant catalyzes the reduced form of NADP+ (NADPH) and α-ketoglutarate (α-KG) to form nicotinamide adenine dinucleotide ph...
Ligand InfoPC cidPC sid
In DepthDetails US Patent
TargetIsocitrate dehydrogenase [NADP] cytoplasmic [R132H](Homo sapiens (Human))
Novartis
US Patent
LigandPNGBDBM247486(US10112931, Example 9 | US9434719, 9 | US9688672, ...)
Affinity DataIC50:  2.20E+3nMpH: 7.5 T: 2°C. Assay description: The IDH1 (R132H) mutant catalyzes the reduced form of NADP+(NADPH) and α-ketoglutarate (α-KG) to form nicotinamide adenine dinucleotide pho...
Ligand InfoPC cidPC sid
In DepthDetails US Patent