BDBM248071 3-{[4-(1,1-dioxido-3-oxoisothiazolidin-2-yl)benzoyl]amino}benzoic acid (21)
SMILES OC(=O)c1cccc(NC(=O)c2ccc(cc2)N2C(=O)CCS2(=O)=O)c1
InChI Key InChIKey=CIUOHXDKABOJFV-UHFFFAOYSA-N
Data  1 IC50
  Tab Delimited (TSV)   2D SDfile   Computed 3D by Vconf -m prep SDfile
Find this compound or compounds like it in BindingDB:
Activity Spreadsheet -- Enzyme Inhibition Constant Data from BindingDB
Found 1 hit for monomerid = 248071
TargetCasein kinase II subunit alpha/beta(Homo sapiens (Human))
Nas Of Ukraine
LigandPNGBDBM248071(3-{[4-(1,1-dioxido-3-oxoisothiazolidin-2-yl)benzoy...)
Affinity DataIC50:  1.80E+3nMpH: 7.5 T: 2°C. Assay description: Each test was performed twice in a total reaction volume of 30 μL, containing 6 μg of peptide substrate RRRDDDSDDD (New England Biolabs (UK) Lt...
In DepthDetails ArticlePubMed