BDBM24982 (2S)-1-[(2S,3S)-1-(benzyloxy)-3-hexyl-4-oxoazetidin-2-yl]heptan-2-yl (2S)-2-formamido-3-methylbutanoate::beta-lactam derivative of orlistat, 14
SMILES CCCCCC[C@H]1[C@H](C[C@H](CCCCC)OC(=O)[C@@H](NC=O)C(C)C)N(OCc2ccccc2)C1=O
InChI Key InChIKey=KOLCVUATDFJCFC-FWEHEUNISA-N
Data  1 IC50
  Tab Delimited (TSV)   2D SDfile   Computed 3D by Vconf -m prep SDfile
Find this compound or compounds like it in BindingDB:
Activity Spreadsheet -- Enzyme Inhibition Constant Data from BindingDB
Found 1 hit for monomerid = 24982
TargetFatty acid synthase [2202-2509](Homo sapiens (Human))
Texas A&M University
LigandPNGBDBM24982((2S)-1-[(2S,3S)-1-(benzyloxy)-3-hexyl-4-oxoazetidi...)
Affinity DataIC50:  5.82E+4nMpH: 7.4 T: 2°C. Assay description: The reaction mixture consisted of FAS thioesterase domain (FASTE) in buffer, which was preincubated with test compounds for 30 min. The reaction was ...
In DepthDetails ArticlePubMed