BDBM24983 (3S,4S)-3-hexyl-4-[(2S)-2-hydroxyheptyl]azetidin-2-one::beta-lactam derivative of orlistat, 15
SMILES CCCCCC[C@H]1[C@H](C[C@@H](O)CCCCC)NC1=O
InChI Key InChIKey=SDXKRQIAIYUKKA-KKUMJFAQSA-N
Data  1 IC50
  Tab Delimited (TSV)   2D SDfile   Computed 3D by Vconf -m prep SDfile
Find this compound or compounds like it in BindingDB:
Activity Spreadsheet -- Enzyme Inhibition Constant Data from BindingDB
Found 1 hit for monomerid = 24983
TargetFatty acid synthase [2202-2509](Homo sapiens (Human))
Texas A&M University
LigandPNGBDBM24983((3S,4S)-3-hexyl-4-[(2S)-2-hydroxyheptyl]azetidin-2...)
Affinity DataIC50:  6.76E+4nMpH: 7.4 T: 2°C. Assay description: The reaction mixture consisted of FAS thioesterase domain (FASTE) in buffer, which was preincubated with test compounds for 30 min. The reaction was ...
Ligand InfoPC cidPC sid
In DepthDetails ArticlePubMed