BDBM25455 4-[6-(3,4-difluorophenyl)-1,2,3,4-tetrahydronaphthalen-1-yl]pyridine::Abiraterone mimetic, 18
SMILES Fc1ccc(cc1F)-c1ccc2C(CCCc2c1)c1ccncc1
InChI Key InChIKey=BJPNKNRGZIZMII-UHFFFAOYSA-N
Data  4 IC50
  Tab Delimited (TSV)   2D SDfile   Computed 3D by Vconf -m prep SDfile
Find this compound or compounds like it in BindingDB:
Activity Spreadsheet -- Enzyme Inhibition Constant Data from BindingDB
Found 4 hits for monomerid = 25455
TargetSteroid 17-alpha-hydroxylase/17,20 lyase(Homo sapiens (Human))
Saarland University
LigandPNGBDBM25455(4-[6-(3,4-difluorophenyl)-1,2,3,4-tetrahydronaphth...)
Affinity DataIC50:  1.22E+3nMpH: 7.4 T: 2°C. Assay description: The 17 alpha-hydroxylase activity of CYP 17 was determined by measuring the conversion of progesterone into 17 alpha-hydroxyprogesterone and the bypr...
In DepthDetails ArticlePubMed
TargetCytochrome P450 3A4(Homo sapiens (Human))
Saarland University
LigandPNGBDBM25455(4-[6-(3,4-difluorophenyl)-1,2,3,4-tetrahydronaphth...)
Affinity DataIC50:  2.30E+3nM. Assay description: To measure CYP3A4 activity, the product of testosterone 6-hydroxylation, 6beta-hydroxytestosterone was determined. After incubation, the reaction was...
In DepthDetails ArticlePubMed
TargetCytochrome P450 11B2, mitochondrial(Homo sapiens (Human))
Saarland University
LigandPNGBDBM25455(4-[6-(3,4-difluorophenyl)-1,2,3,4-tetrahydronaphth...)
Affinity DataIC50:  567nM. Assay description: The enzyme activity was assayed by monitoring the conversion of deoxycorticosterone to corticosterone in the presence of inhibitor compounds. The pro...
In DepthDetails ArticlePubMed
TargetCytochrome P450 11B1, mitochondrial(Homo sapiens (Human))
Saarland University
LigandPNGBDBM25455(4-[6-(3,4-difluorophenyl)-1,2,3,4-tetrahydronaphth...)
Affinity DataIC50: >2.00E+4nM. Assay description: The enzyme activity was assayed by monitoring the conversion of deoxycorticosterone to corticosterone in the presence of inhibitor compounds. The pro...
In DepthDetails ArticlePubMed