BDBM25993 N-[(4-chlorophenyl)methyl]-N-methyl-4-[2-methyl-5-(5-methyl-1,3,4-oxadiazol-2-yl)phenyl]benzamide::N-substituted benzyl amide analog., 14
SMILES CN(Cc1ccc(Cl)cc1)C(=O)c1ccc(cc1)-c1cc(ccc1C)-c1nnc(C)o1
InChI Key InChIKey=FCHPZLSLIWSCQU-UHFFFAOYSA-N
Data  1 KI  1 IC50
  Tab Delimited (TSV)   2D SDfile   Computed 3D by Vconf -m prep SDfile
Find this compound or compounds like it in BindingDB:
Activity Spreadsheet -- Enzyme Inhibition Constant Data from BindingDB
Found 1 hit for monomerid = 25993
TargetMitogen-activated protein kinase 14(Homo sapiens (Human))
Gsk
LigandPNGBDBM25993(N-[(4-chlorophenyl)methyl]-N-methyl-4-[2-methyl-5-...)
Affinity DataKi:  140nM ΔG°:  -9.25kcal/mole IC50:  890nMpH: 7.5 T: 2°C. Assay description: Fluorescence polarization assays used GST-tagged enzyme and an ATP-competitive Rhodamine-green labelled fluoroligand. These components were dissolved...
In DepthDetails ArticlePubMed