BDBM261779 Ethyl 3-amino-4-[(3-methoxypropyl)amino]benzoate::US9708311, 30
SMILES CCOC(=O)c1ccc(NCCCOC)c(N)c1
InChI Key InChIKey=GMZZEDWJBPBODR-UHFFFAOYSA-N
Data  1 IC50
  Tab Delimited (TSV)   2D SDfile   Computed 3D by Vconf -m prep SDfile
Find this compound or compounds like it in BindingDB:
Activity Spreadsheet -- Enzyme Inhibition Constant Data from BindingDB
Found 1 hit for monomerid = 261779
TargetProstaglandin E2 receptor EP4 subtype(Homo sapiens (Human))
Bayer Pharma Aktiengesellschaft
US Patent
LigandPNGBDBM261779(Ethyl 3-amino-4-[(3-methoxypropyl)amino]benzoate |...)
Affinity DataIC50:  30.1nMT: 2°C. Assay description: 4 μl of a cAMP-d2/cell suspension (625000 cells/ml) were added to a test plate containing the substance solutions already initially introduced (...
In DepthDetails US Patent