BDBM262106 6-Amino-9-[(4-chlorophenyl)methyl]-2-(propylsulfonimidoyl)-7H-purin-8-one::BDBM262107::US11242345, Example 9::US9708325, 9
SMILES CCCS(=N)(=O)c1nc(N)c2[nH]c(=O)n(Cc3ccc(Cl)cc3)c2n1
InChI Key
Data  4 EC50
  Tab Delimited (TSV)   2D SDfile   Computed 3D by Vconf -m prep SDfile
Find this compound or compounds like it in BindingDB:
Activity Spreadsheet -- Enzyme Inhibition Constant Data from BindingDB
Found 4 hits for monomerid = 262106
TargetToll-like receptor 7(Homo sapiens (Human))
Hoffmann-La Roche
US Patent
LigandPNGBDBM262106(6-Amino-9-[(4-chlorophenyl)methyl]-2-(propylsulfon...)
Affinity DataEC50:  12nM. Assay description: HEK-Blue-hTLR7 cells were incubated at a density of 250,000˜450,000 cells/mL in a volume of 180 μL in a 96-well plate in Dulbecco's Mod...
Ligand InfoPC cidPC sid
In DepthDetails US Patent
TargetToll-like receptor 7(Homo sapiens (Human))
Hoffmann-La Roche
US Patent
LigandPNGBDBM262106(6-Amino-9-[(4-chlorophenyl)methyl]-2-(propylsulfon...)
Affinity DataEC50:  12nM. Assay description: A stable HEK-Blue-hTLR7 cell line was purchased from InvivoGen (Cat. #: hkb-htlr7, San Diego, Calif., USA). These cells were designed for studying th...
Ligand InfoPC cidPC sid
In DepthDetails US Patent
TargetToll-like receptor 7(Homo sapiens (Human))
Hoffmann-La Roche
US Patent
LigandPNGBDBM262106(6-Amino-9-[(4-chlorophenyl)methyl]-2-(propylsulfon...)
Affinity DataEC50:  11nM. Assay description: HEK-Blue-hTLR7 cells were incubated at a density of 250,000˜450,000 cells/mL in a volume of 180 μL in a 96-well plate in Dulbecco's Mod...
Ligand InfoPC cidPC sid
In DepthDetails US Patent
TargetToll-like receptor 7(Homo sapiens (Human))
Hoffmann-La Roche
US Patent
LigandPNGBDBM262106(6-Amino-9-[(4-chlorophenyl)methyl]-2-(propylsulfon...)
Affinity DataEC50:  14nM. Assay description: HEK-Blue-hTLR7 cells were incubated at a density of 250,000˜450,000 cells/mL in a volume of 180 μL in a 96-well plate in Dulbecco's Mod...
Ligand InfoPC cidPC sid
In DepthDetails US Patent