BDBM263648 3-fluoropropyl 4-(((1-(tert-butyl)-5-chloro-6-oxo-1,6-dihydropyridazin-4-yl)oxy)methyl)benzoate::US9713651, 57B
SMILES CC(C)(C)n1ncc(OCc2ccc(cc2)C(=O)OCCCF)c(Cl)c1=O
InChI Key InChIKey=KKHAMXRWWGGPAA-UHFFFAOYSA-N
Data  1 IC50
  Tab Delimited (TSV)   2D SDfile   Computed 3D by Vconf -m prep SDfile
Find this compound or compounds like it in BindingDB:
Activity Spreadsheet -- Enzyme Inhibition Constant Data from BindingDB
Found 1 hit for monomerid = 263648
TargetNADH dehydrogenase [ubiquinone] flavoprotein 1, mitochondrial(Bos taurus)
Lantheus Medical Imaging
US Patent
LigandPNGBDBM263648(3-fluoropropyl 4-(((1-(tert-butyl)-5-chloro-6-oxo-...)
Affinity DataIC50: <100nMpH: 7.4Assay Description:The procedure for determining catalytic activity of submitochondrial particles was adapted from Satoh et al. (e.g., see Satoh T, Miyoshi H, Sakamoto ...
Ligand InfoPC cidPC sid
In DepthDetails US Patent