BDBM27175 Azithromycinarylalkylhydroxamic Acid, 8
SMILES CC[C@H]1OC(=O)[C@H](C)[C@@H](O[C@H]2C[C@@](C)(OC)[C@@H](O)[C@H](C)O2)[C@H](C)[C@@H](O[C@@H]2O[C@H](C)C[C@@H]([C@H]2O)N(C)Cc2ccc(NC(=O)CCCCCCC(=O)NO)cc2)[C@](C)(O)C[C@@H](C)CN(C)[C@H](C)[C@@H](O)[C@]1(C)O
InChI Key InChIKey=FRRIWMVHMJBTRB-CSAKRERUSA-N
Data  2 IC50
  Tab Delimited (TSV)   2D SDfile   Computed 3D by Vconf -m prep SDfile
Find this compound or compounds like it in BindingDB:
Activity Spreadsheet -- Enzyme Inhibition Constant Data from BindingDB
Found 2 hits for monomerid = 27175
TargetHistone deacetylase 8(Homo sapiens (Human))
Georgia Institute Of Technology
LigandPNGBDBM27175(Azithromycinarylalkylhydroxamic Acid, 8)
Affinity DataIC50:  6.68E+3nMpH: 8.0 T: 2°C. Assay description: The Fluor-de-Lys HDAC activity assay kit (Biomol) was used. Purified recombinant HDAC enzyme was incubated with Fluor-de-Lys substrate in the presenc...
In DepthDetails ArticlePubMed
TargetHistone deacetylase 1(Homo sapiens (Human))
Georgia Institute Of Technology
LigandPNGBDBM27175(Azithromycinarylalkylhydroxamic Acid, 8)
Affinity DataIC50:  107nMpH: 8.0 T: 2°C. Assay description: The Fluor-de-Lys HDAC activity assay kit (Biomol) was used. Purified recombinant HDAC enzyme was incubated with Fluor-de-Lys substrate in the presenc...
In DepthDetails ArticlePubMed