BDBM274724 2-fluoro-N-(6-(4-(4-fluoro-3- methylphenyl)-1-(2-fluoroethyl)- 2-methyl-1H-imidazol-5-yl) imidazo[1,2-b]pyridazin-2-yl) isonicotinamide::US9556179, Compound 299
SMILES Cc1nc(c(-c2ccc3nc(NC(=O)c4ccnc(F)c4)cn3n2)n1CCF)-c1ccc(F)c(C)c1
InChI Key InChIKey=FVNYMOLCZLYWIA-UHFFFAOYSA-N
Data  2 IC50
  Tab Delimited (TSV)   2D SDfile   Computed 3D by Vconf -m prep SDfile
Find this compound or compounds like it in BindingDB:
Activity Spreadsheet -- Enzyme Inhibition Constant Data from BindingDB
Found 2 hits for monomerid = 274724
TargetCasein kinase I isoform delta(Homo sapiens (Human))
Bristol-Myers Squibb
US Patent
LigandPNGBDBM274724(2-fluoro-N-(6-(4-(4-fluoro-3- methylphenyl)-1-(2-f...)
Affinity DataIC50:  0.186nMpH: 7.4 T: 2°C. Assay description: The kinase assay was performed in V-bottom 384-well plates. The final assay volume was 30 μl prepared from 15 μl additions of enzyme, subst...
Ligand InfoPC cidPC sid
In DepthDetails US Patent
TargetCasein kinase I isoform epsilon(Homo sapiens (Human))
Bristol-Myers Squibb
US Patent
LigandPNGBDBM274724(2-fluoro-N-(6-(4-(4-fluoro-3- methylphenyl)-1-(2-f...)
Affinity DataIC50:  0.760nMpH: 7.4 T: 2°C. Assay description: The kinase assay was performed in V-bottom 384-well plates. The final assay volume was 30 μl prepared from 15 μl additions of enzyme, subst...
Ligand InfoPC cidPC sid
In DepthDetails US Patent