BDBM28070 ethyl 4-{[(4Z)-1,3-dioxo-4-({[4-(piperidin-1-ylmethyl)phenyl]amino}methylidene)-1,2,3,4-tetrahydroisoquinolin-6-yl]amino}benzoate::isoquinolinedione, 25
SMILES CCOC(=O)c1ccc(Nc2ccc3C(=O)NC(=O)C(=CNc4ccc(CN5CCCCC5)cc4)c3c2)cc1
InChI Key InChIKey=NIWURZPXHKKFMY-UHFFFAOYSA-N
Data  1 IC50
  Tab Delimited (TSV)   2D SDfile   Computed 3D by Vconf -m prep SDfile
Find this compound or compounds like it in BindingDB:
Activity Spreadsheet -- Enzyme Inhibition Constant Data from BindingDB
Found 1 hit for monomerid = 28070
TargetInsulin-like growth factor 1 receptor(Homo sapiens (Human))
Wyeth Research
LigandPNGBDBM28070(ethyl 4-{[(4Z)-1,3-dioxo-4-({[4-(piperidin-1-ylmet...)
Affinity DataIC50: >1.00E+4nMpH: 7.5 T: 2°C. Assay description: Assays were performed in microtiter plates in reaction buffer containing biotinylated substrate, ATP, and purified kinase in the presence of test com...
In DepthDetails ArticlePubMed