BDBM28099 3-cyanoquinoline, 24::4-({3-chloro-4-[(1-ethyl-4,5-dimethyl-1H-imidazol-2-yl)sulfanyl]phenyl}amino)-7-[3-(dimethylamino)propoxy]-6-methoxyquinoline-3-carbonitrile
SMILES CCn1c(C)c(C)nc1Sc1ccc(Nc2c(cnc3cc(OCCCN(C)C)c(OC)cc23)C#N)cc1Cl
InChI Key InChIKey=RUSLGWBGHWESBE-UHFFFAOYSA-N
Data  1 IC50
  Tab Delimited (TSV)   2D SDfile   Computed 3D by Vconf -m prep SDfile
Find this compound or compounds like it in BindingDB:
Activity Spreadsheet -- Enzyme Inhibition Constant Data from BindingDB
Found 1 hit for monomerid = 28099
TargetInsulin-like growth factor 1 receptor(Homo sapiens (Human))
Wyeth Research
LigandPNGBDBM28099(3-cyanoquinoline, 24 | 4-({3-chloro-4-[(1-ethyl-4,...)
Affinity DataIC50:  30nMpH: 7.5 T: 2°C. Assay description: Assays were performed in microtiter plates in reaction buffer containing biotinylated substrate, ATP, and purified kinase in the presence of test com...
In DepthDetails ArticlePubMed