BDBM285997 (+/-)-Methyl N-{8-[3-(3-methoxyphenyl)piperidine-1-carbonyl]-2,10-dioxo-1,2,3,4,5,6,7,8,9,10-decahydro-1,9-benzodiazacyclododecin-13-yl}carbamate::US10081623, Example 10
SMILES COC(=O)Nc1ccc2c(NC(=O)CCCCCC(NC2=O)C(=O)N2CCCC(C2)c2cccc(OC)c2)c1
InChI Key InChIKey=CZBLXVNNWXXENU-UHFFFAOYSA-N
Data  1 KI
  Tab Delimited (TSV)   2D SDfile   Computed 3D by Vconf -m prep SDfile
Find this compound or compounds like it in BindingDB:
Activity Spreadsheet -- Enzyme Inhibition Constant Data from BindingDB
Found 1 hit for monomerid = 285997
TargetCoagulation factor XI(Homo sapiens (Human))
Bristol-Myers Squibb
US Patent
LigandPNGBDBM285997((+/-)-Methyl N-{8-[3-(3-methoxyphenyl)piperidine-1...)
Affinity DataKi:  2.62E+3nMpH: 7.4Assay Description:The effectiveness of compounds of the present invention as inhibitors of the coagulation Factors XIa, VIIa, IXa, Xa, XIIa, plasma kallikrein or throm...
Ligand InfoPC cidPC sid
In DepthDetails US Patent