BDBM28995 (2R)-2-{[5-chloro-2-(hydroxymethyl)phenyl](4-chlorobenzene)sulfonamido}propyl N-(propan-2-yl)carbamate::Carbamate-appended N-alkylsulfonamide, 17
SMILES CC(C)NC(=O)OC[C@@H](C)N(c1cc(Cl)ccc1CO)S(=O)(=O)c1ccc(Cl)cc1
InChI Key InChIKey=GRVMHMVGYPNSMM-CQSZACIVSA-N
Data  1 EC50
  Tab Delimited (TSV)   2D SDfile   Computed 3D by Vconf -m prep SDfile
Find this compound or compounds like it in BindingDB:
Activity Spreadsheet -- Enzyme Inhibition Constant Data from BindingDB
Found 1 hit for monomerid = 28995
LigandPNGBDBM28995((2R)-2-{[5-chloro-2-(hydroxymethyl)phenyl](4-chlor...)
Affinity DataEC50:  12nM. Assay description: H4 human neuroglioma cells expressing beta-APP were aliquoted into a 96-well plate, and after attachment the medium was replaced with the conditioned...
In DepthDetails ArticlePubMed