BDBM290 (2R,3R)-1,1-dioxo-2-(propan-2-yl)--thiolan-3-yl N-[(2S,3R)-4-[(2S)-2-(tert-butylcarbamoyl)-4-propylpiperazin-1-yl]-3-hydroxy-1-phenylbutan-2-yl]carbamate::1-(2OHPr)-4-Substit-piperazine, thienyl carbamate deriv. 1
SMILES CCCN1CCN(C[C@@H](O)[C@H](Cc2ccccc2)NC(=O)O[C@@H]2CCS(=O)(=O)[C@@H]2C(C)C)[C@@H](C1)C(=O)NC(C)(C)C
InChI Key InChIKey=KIUZLKJJOFIWAW-OFOQQJIRSA-N
Data  2 IC50
  Tab Delimited (TSV)   2D SDfile   Computed 3D by Vconf -m prep SDfile
Find this compound or compounds like it in BindingDB:
Activity Spreadsheet -- Enzyme Inhibition Constant Data from BindingDB
Found 2 hits for monomerid = 290
TargetGag-Pol polyprotein [489-587](Human immunodeficiency virus type 1)
Merck Research Laboratories
LigandPNGBDBM290((2R,3R)-1,1-dioxo-2-(propan-2-yl)--thiolan-3-yl N-...)
Affinity DataIC50:  14nM. Assay description: Tested in vitro for the ability to inhibit HIV-1 protease
In DepthDetails Article
TargetDimer of Gag-Pol polyprotein [489-587](Human immunodeficiency virus type 1)
Merck Research Laboratories
LigandPNGBDBM290((2R,3R)-1,1-dioxo-2-(propan-2-yl)--thiolan-3-yl N-...)
Affinity DataIC50:  13.7nMpH: 5.2 T: 2°C. Assay description: Sensitivity of HIV-1 protease activity to protease inhibitors was determined by a peptide substrate cleavage assay. Protease products were analyzed o...
In DepthDetails Article