BDBM29003 (3R)-3-{[5-chloro-2-(hydroxymethyl)phenyl](4-chlorobenzene)sulfonamido}butyl N-[3-(1H-imidazol-1-yl)propyl]carbamate::Carbamate-appended N-alkylsulfonamide, 30
SMILES C[C@H](CCOC(=O)NCCCn1ccnc1)N(c1cc(Cl)ccc1CO)S(=O)(=O)c1ccc(Cl)cc1
InChI Key InChIKey=XGXYZPGKHOYPJR-GOSISDBHSA-N
Data  1 EC50
  Tab Delimited (TSV)   2D SDfile   Computed 3D by Vconf -m prep SDfile
Find this compound or compounds like it in BindingDB:
Activity Spreadsheet -- Enzyme Inhibition Constant Data from BindingDB
Found 1 hit for monomerid = 29003
LigandPNGBDBM29003((3R)-3-{[5-chloro-2-(hydroxymethyl)phenyl](4-chlor...)
Affinity DataEC50:  7.70nM. Assay description: H4 human neuroglioma cells expressing beta-APP were aliquoted into a 96-well plate, and after attachment the medium was replaced with the conditioned...
In DepthDetails ArticlePubMed