BDBM290145 US9572811, Example 36A
SMILES CN(CCn1nc(-c2ccc(Oc3ccccc3)cc2)c2c(N)ncnc12)C(=O)C(=CC1CC1)C#N
InChI Key InChIKey=NMDUHIKHSSEMNE-HMMYKYKNSA-N
Data  1 IC50
  Tab Delimited (TSV)   2D SDfile   Computed 3D by Vconf -m prep SDfile
Find this compound or compounds like it in BindingDB:
Activity Spreadsheet -- Enzyme Inhibition Constant Data from BindingDB
Found 1 hit for monomerid = 290145
TargetTyrosine-protein kinase BTK(Homo sapiens (Human))
Principia Biopharma
US Patent
LigandPNGBDBM290145(US9572811, Example 36A)
Affinity DataIC50:  4.30nMT: 2°C. Assay description: A Caliper-based kinase assay (Caliper Life Sciences, Hopkinton, Mass.) was used to measure inhibition of Btk kinase activity of a compound of Formula...
Ligand InfoPC cidPC sid
In DepthDetails US Patent