BDBM290788 US9579320, Example 187::tert-butyl 2-(3-(2-((1R,2S)-2-aminocyclohexylamino)-5-carbamoylpyrimidin-4-ylamino)phenoxy)acetate (Racemate)
SMILES CC(C)(C)OC(=O)COc1cccc(Nc2nc(N[C@@H]3CCCC[C@@H]3N)ncc2C(N)=O)c1
InChI Key InChIKey=MZXCLXVMBXNWQQ-ZWKOTPCHSA-N
Data  1 IC50
  Tab Delimited (TSV)   2D SDfile   Computed 3D by Vconf -m prep SDfile
Find this compound or compounds like it in BindingDB:
Activity Spreadsheet -- Enzyme Inhibition Constant Data from BindingDB
Found 1 hit for monomerid = 290788
TargetTyrosine-protein kinase SYK(Homo sapiens (Human))
Portola Pharmaceuticals
US Patent
LigandPNGBDBM290788(US9579320, Example 187 | tert-butyl 2-(3-(2-((1R,2...)
Affinity DataIC50:  550nMpH: 7.5 T: 2°C. Assay description: Potency of candidate molecules for inhibiting syk tyrosine phosphorylation activity is assessed by measuring the ability of a test compound to inhibi...
Ligand InfoPC cidPC sid
In DepthDetails US Patent